Vocabulario para la representación de datos de territorio (incluyendo divisiones administrativas) en España
type: Ontology
version IRI: territorio v0.5
license: http://creativecommons.org/licenses/by/4.0/
creator: David Portolés (Idearium Consultores)
creator: Esther Minguela (LocaliData)
creator: José María Subero (Gobierno de Aragón)
creator: María Jesús Fernández (Ayuntamiento de Zaragoza)
creator: Oscar Corcho (Ontology Engineering Group - Universidad Politécnica de Madrid, LocaliData)
creator: Paola Espinoza (Ontology Engineering Group, Universidad Politécnica de Madrid)
date: 2018-01-08
rights: Creative Commons Attribution 4.0 International (CC BY 4.0)
has format: territorio.html
has format: territorio.owl
issued: 2018-01-08
preferred namespace uri: http://vocab.linkeddata.es/datosabiertos/def/sector-publico/territorio#
comment: Este vocabulario se utiliza para la descripción de territorios en España (incluyendo divisiones administrativas y también otros conceptos que se utilizan normalmente pero no tienen entidad jurídica, como por ejemplo barrios). Reutiliza términos de varios vocabularios y modelos que actualmente se utilizan para propósitos similares (y por tanto se irá actualizando de acuerdo con la evolución de estos vocabularios), incluyendo: - schema.org - GeoSPARQL - GeoNames - DBpedia - Ontología Jurídica Libre - Modelo de direcciones de la Administración General del Estado v.2 Esta ontología sufrirá cambios continuados hasta que se consiga un acuerdo suficiente sobre los términos que se incluyen en ella. También debe incluir términos definidos por comunidades autónomas y municipios (por ejemplo, entidades locales autónomas en Andalucía, juntas vecinales, concejos, pedanías, etc.)
version info: En esta ontología se han añadido los siguientes conceptos: - ComunidadJurisdiccional También se han renombrado las siguientes propiedades: - codigoMunicipioINE se ha renombrado a codigoINE - codigoMunicipioCatastro se ha renombrado a codigoCatastro Se ha añadido la siguiente propiedad: - esCapitalDe Y se ha incluido como aplicable la propiedad geonames:population para cualquier unidad territorial

área metropolitana
type: ObjectProperty
sub property of: sfWithin
range: Área metropolitana
issued: 2014-05-03
comment: Área metropolitana a la que pertenece un fenómeno geográfico o una entidad administrativa

pertenece a la autonomía
type: ObjectProperty
sub property of: sfWithin
range: Autonomía
issued: 2014-03-28
comment: Autonomía (Comunidad Autónoma o Ciudad Autónoma) a la que pertenece un fenómeno geográfico o una entidad administrativa

pertenece al barrio
type: ObjectProperty
sub property of: sfWithin
range: Barrio
issued: 2014-03-28
comment: Barrio al que pertenece un fenómeno geográfico o una entidad administrativa

cabeza del partido judicial
type: ObjectProperty
sub property of: sfContains
type: FunctionalProperty
domain: Partido judicial
range: Municipio
issued: 2014-05-03
comment: Municipio que es cabeza del partido judicial

capital
type: ObjectProperty
sub property of: sfContains
range: Municipio
issued: 2014-05-03
comment: Municipio que es considerado capital de otro territorio (por ejemplo, una autonomía, provincia, comarca, etc.)

pertenece a la comarca
type: ObjectProperty
sub property of: sfWithin
range: Comarca
issued: 2014-03-28
comment: Comarca a la que pertenece un fenómeno geográfico o una entidad administrativa

pertenece al diseminado
type: ObjectProperty
sub property of: sfWithin
range: Diseminado
issued: 2014-04-15
comment: Diseminado al que pertenece un fenómeno geográfico o una entidad administrativa

pertenece al distrito
type: ObjectProperty
sub property of: sfWithin
range: Distrito
issued: 2014-03-28
comment: Distrito al que pertenece un fenómeno geográfico o una entidad administrativa

pertenece a entidad colectiva
type: ObjectProperty
sub property of: sfWithin
range: Entidad colectiva
issued: 2014-04-15
comment: Entidad colectiva a la que pertenece un fenómeno geográfico o una entidad administrativa

pertenece a entidad singular
type: ObjectProperty
sub property of: sfWithin
range: Entidad Singular
issued: 2014-04-15
comment: Entidad singular a la que pertenece un fenómeno geográfico o una entidad administrativa

es capital de
type: ObjectProperty
sub property of: sfWithin
inverse of: capital
issued: 2018-01-08
comment: Especifica una unidad territorial de la que esta unidad territorial es capital

estado
type: ObjectProperty
range: Concept
issued: 2014-04-15
comment: Validez del elemento en su ciclo de vida (versión). Puede ser histórico, vigente o provisional. Se definen en el esquema de conceptos http://vocab.linkeddata.es/datosabiertos/kos/sector-publico/territorio/tipo-estado y toman valores: http://vocab.linkeddata.es/datosabiertos/kos/sector-publico/territorio/tipo-estado/historico http://vocab.linkeddata.es/datosabiertos/kos/sector-publico/territorio/tipo-estado/vigente http://vocab.linkeddata.es/datosabiertos/kos/sector-publico/territorio/tipo-estado/provisional

isla
type: ObjectProperty
sub property of: sfWithin
issued: 2014-05-03
comment: Isla a la que pertenece un fenómeno geográfico o una entidad administrativa

pertenece a la junta administrativa
type: ObjectProperty
sub property of: sfWithin
range: Junta administrativa
issued: 2014-03-28
comment: Junta Administrativa a la que pertenece un fenómeno geográfico o una entidad administrativa

mancomunidad
type: ObjectProperty
sub property of: sfWithin
range: Mancomunidad
issued: 2014-05-03
comment: Mancomunidad a la que pertenece un fenómeno geográfico o una entidad administrativa

pertenece al municipio
type: ObjectProperty
sub property of: sfWithin
range: Municipio
issued: 2014-03-28
comment: Municipio al que pertenece un fenómeno geográfico o una entidad administrativa

pertenece al núcleo de población
type: ObjectProperty
sub property of: sfWithin
range: Núcleo de Población
issued: 2014-04-15
comment: Núcleo de población al que pertenece un fenómeno geográfico o una entidad administrativa

pertenece al país
type: ObjectProperty
sub property of: sfWithin
range: País
issued: 2014-03-28
comment: País al que pertenece un fenómeno geográfico o una entidad administrativa

partidoJudicial
type: ObjectProperty
sub property of: sfWithin
range: Partido judicial
issued: 2014-05-03
comment: Partido judicial al que pertenece un fenómeno geográfico o una entidad administrativa
comment: pertenece al partido judicial

pertenece a provincia
type: ObjectProperty
sub property of: sfWithin
range: Provincia
issued: 2014-04-15
comment: Provincia a la que pertenece un fenómeno geográfico o una entidad administrativa

pertenece a la sección censal
type: ObjectProperty
sub property of: sfWithin
range: Sección censal
issued: 2014-03-28
comment: Vocabulario para la representación de datos de territorio (incluyendo divisiones administrativas) en España
comment: Sección censal a la que pertenece un fenómeno geográfico o una entidad administrativa

identificador
type: DatatypeProperty
comment: identificador del recurso

código de la entidad territorial según Catastro
type: DatatypeProperty
sub property of: identificador
issued: 2018-01-08
comment: Código que asigna Catastro a la entidad territorial, en caso de existir la relación.

código de la entidad territorial según el INE
type: DatatypeProperty
sub property of: identificador
issued: 2018-01-08
comment: Código de la entidad territorial del INE. Por ejemplo, para municipios este código es de tres dígitos y está definido en http://www.ine.es/daco/daco42/codmun/codmun09/09codmun.xls

código de país ISO
type: DatatypeProperty
comment: Un código de país de dos letras, de la lista ISO 3166

nombre internacional
type: DatatypeProperty
comment: El nombre con el que se conoce internacionalmente este fenómeno geográfico. No lleva asociado un valor para xml:lang

nombre oficial
type: DatatypeProperty
comment: Un nombre en el idioma oficial local

población
type: DatatypeProperty
comment: Número total de habitantes del núcleo según el nomenclátor del INE para el año que aparezca en los metadatos

Área metropolitana
type: Class
subclass of: Feature
subclass of: Restriction
subclass of: Restriction
  on property: featureClass
  has value: http://www.geonames.org/ontology#A
subclass of: Restriction
  on property: featureCode
  has value: A.ADMD
issued: 2014-05-03
comment: Un área o zona metropolitana es una región urbana que engloba una ciudad central que da nombre al área y una serie de ciudades satélites que pueden funcionar como ciudades dormitorio, industriales, comerciales y servicios, todo ello organizado de una manera centralizada. También se la conoce como red urbana. [fuente: Wikipedia] Nota: Si existe una definición oficial de lo que es un área metropolitana, sería bueno incluirla, en lugar de la referencia anterior.

Axiom
annotated source: Área metropolitana
annotated property: subClassOf
annotated target: Restriction
comment: Esta definición puede ser modificada si se determina que otros tipos de entidades (colectivas, singulares, etc.) pueden participar en un área metropolitana.

Autonomía
type: Class
subclass of: GovernmentalAdministrativeRegion
subclass of: AdministrativeArea
subclass of: Feature
subclass of: Restriction
  on property: featureClass
  has value: http://www.geonames.org/ontology#A
subclass of: Restriction
  on property: featureCode
  has value: A.ADMD
subclass of: Restriction
  on property: capital
  qualified cardinality: 1
  on class: Municipio
issued: 2014-03-28
comment: Comunidad Autónoma o Ciudad Autónoma

Barrio
type: Class
subclass of: Feature
subclass of: Restriction
  on property: featureClass
  has value: http://www.geonames.org/ontology#P
subclass of: Restriction
  on property: featureCode
  has value: P.PPLX
subclass of: Restriction
  on property: pertenece al municipio
  qualified cardinality: 1
  on class: Municipio
issued: 2014-03-28
comment: Un barrio es cada una de las partes en que se dividen los pueblos grandes o sus distritos [fuente: Diccionario de la Real Academia (DRAE) 2011]

Ciudad
type: Class
subclass of: AdministrativeArea
subclass of: Municipio
subclass of: Feature
issued: 2014-04-15
comment: Una ciudad es un área urbana en la que predominan fundamentalmente la industria y los servicios [fuente: Wikipedia]

Ciudad Autónoma
type: Class
subclass of: Autonomía
disjoint with: Comunidad Autónoma
issued: 2014-03-28
comment: Ciudad con competencias superiores a las de un municipio (pueden decretar regulaciones ejecutivas, con competencias reguladoras mayores que las de un municipio) pero inferiores a las de una comunidad autónoma (puesto que no tienen cámaras legislativas propiamente dichas) [fuente: Wikipedia]

Comarca
type: Class
subclass of: GovernmentalAdministrativeRegion
subclass of: AdministrativeArea
subclass of: Feature
subclass of: Restriction
  on property: sfContains
  some values from: Class
    union of: Diseminado
    union of: Entidad colectiva
    union of: Entidad Singular
    union of: Municipio
    union of: Núcleo de Población
subclass of: Restriction
  on property: featureClass
  has value: http://www.geonames.org/ontology#A
subclass of: Restriction
  on property: featureCode
  has value: A.ADMD
subclass of: Restriction
  on property: capital
  qualified cardinality: 1
  on class: Municipio
issued: 2014-03-28
comment: Una comarca es una entidad local territorial según el artículo 3.2.b) de la Ley 7/1985, de 2 de abril, Reguladora de las Bases del Régimen Local

Comunidad Autónoma
type: Class
subclass of: Autonomía
issued: 2014-03-28
comment: Entidad territorial que, dentro del ordenamiento constitucional del Estado español, está dotada de autonomía legislativa y competencias ejecutivas, así como de la facultad de administrarse mediante sus propios representantes [fuente: Diccionario de la lengua española (DRAE) 2011]

Comunidad jurisdiccional
type: Class
subclass of: AdministrativeArea
issued: 2018-01-08
comment: Las Comunidades Jurisdiccionales se definen como aquellos territorios con superficie propia cuya gestión o uso es realizado por varios municipios, provincias o es directamente estatal. Su existencia es el resultado de los trabajos de campo originales realizados para la delimitación de los municipios y su representación en la primera edición del Mapa Topográfico Nacional a escala 1:50.000 (fuente: Instituto Geográfico Nacional)

Diseminado
type: Class
subclass of: Feature
subclass of: Restriction
  on property: featureClass
  has value: http://www.geonames.org/ontology#P
subclass of: Restriction
  on property: featureCode
  has value: P.PPLL
subclass of: Restriction
  on property: pertenece a entidad singular
  qualified cardinality: 1
  on class: Entidad Singular
subclass of: Restriction
  on property: pertenece al municipio
  qualified cardinality: 1
  on class: Municipio
issued: 2014-04-15
comment: Edificación o Vivienda de una Entidad Singular de población que no puede ser incluido en el concepto de Núcleo [fuente: Modelo de Direcciones de la Administración General del Estado v.2] Su identificador se especifica con la propiedad dct:identifier, y su nombre se especifica con la propiedad dct:title. Ambos están recogidos por el INE en el Nomenclátor de Unidades Poblacionales, en http://www.ine.es/nomen2/index.do

Distrito
type: Class
subclass of: District
subclass of: Feature
subclass of: Restriction
  on property: featureClass
  has value: http://www.geonames.org/ontology#P
subclass of: Restriction
  on property: featureCode
  has value: P.PPLX
subclass of: Restriction
  on property: pertenece al municipio
  qualified cardinality: 1
  on class: Municipio
issued: 2014-03-28
comment: Un distrito es cada una de las demarcaciones en que se subdivide un territorio o una población para distribuir y ordenar el ejercicio de los derechos civiles y políticos, o de las funciones públicas, o de los servicios administrativos [fuente: Diccionario de la Real Academia (DRAE) 2011]

Entidad colectiva
type: Class
subclass of: Feature
subclass of: Restriction
  on property: sfContains
  some values from: Class
    union of: Diseminado
    union of: Entidad Singular
    union of: Núcleo de Población
subclass of: Restriction
  on property: featureClass
  has value: http://www.geonames.org/ontology#P
subclass of: Restriction
  on property: featureCode
  has value: P.PPL
subclass of: Restriction
  on property: pertenece al municipio
  qualified cardinality: 1
  on class: Municipio
issued: 2014-04-15
comment: Unidad intermedia entre el Municipio y la Entidad Singular, es la entidad de máximo nivel dentro de la Unidad Poblacional, agrupando a una o varias Entidades Singulares (parroquias, hermandades, anteiglesias...) [fuente: Modelo de Direcciones de la Administración General del Estado v.2] Su identificador se especifica con la propiedad dct:identifier, y su nombre se especifica con la propiedad dct:title. Ambos están recogidos por el INE en el Nomenclátor de Unidades Poblacionales, en http://www.ine.es/nomen2/index.do

Entidad Singular
type: Class
subclass of: Feature
subclass of: Restriction
  on property: sfContains
  some values from: Class
    union of: Diseminado
    union of: Núcleo de Población
subclass of: Restriction
  on property: featureClass
  has value: http://www.geonames.org/ontology#P
subclass of: Restriction
  on property: featureCode
  has value: P.PPL
subclass of: Restriction
  on property: pertenece al municipio
  qualified cardinality: 1
  on class: Municipio
issued: 2014-04-15
comment: Cualquier área habitable del término municipal, habitada o, excepcionalmente, deshabitada, claramente diferenciada dentro del mismo, y que es conocida por una denominación específica que la identifica sin posibilidad de confusión [fuente: Modelo de Direcciones de la Administración General del Estado v.2] Su identificador se especifica con la propiedad dct:identifier, y su nombre se especifica con la propiedad dct:title. Ambos están recogidos por el INE en el Nomenclátor de Unidades Poblacionales, en http://www.ine.es/nomen2/index.do

Isla
type: Class
subclass of: Island
subclass of: Feature
subclass of: Restriction
  on property: featureClass
  has value: http://www.geonames.org/ontology#T
subclass of: Restriction
  on property: featureCode
  has value: T.ISL
issued: 2014-05-03
comment: Una isla es una zona de tierra firme, más o menos extensa, rodeada completamente por una masa de agua, de tamaño menor que un continente [fuente: Wikipedia] Nota: Si existe una definición oficial de lo que es una isla, desde el punto de vista administrativo, sería bueno incluirla, en lugar de la referencia anterior.

Junta administrativa
type: Class
subclass of: Feature
subclass of: Restriction
  on property: featureClass
  has value: http://www.geonames.org/ontology#P
subclass of: Restriction
  on property: featureCode
  has value: P.PPLX
subclass of: Restriction
  on property: pertenece al municipio
  qualified cardinality: 1
  on class: Municipio
issued: 2014-03-28
comment: Una junta administrativa rige los intereses peculiares de un pueblo que, en unión con otros, forma un municipio [fuente: Diccionario de la Real Academia (DRAE) 2011] En determinados municipios pueden existir subdivisiones de este concepto. Por ejemplo, en Zaragoza se consideran dos tipos de juntas: Juntas Municipales y Juntas Vecinales [fuente: REGLAMENTO DE ÓRGANOS TERRITORIALES Y PARTICIPACIÓN CIUDADANA, http://www.zaragoza.es/ciudad/normativa/detalle_Normativa?id=109]

Mancomunidad
type: Class
subclass of: Feature
subclass of: Restriction
  on property: sfContains
  some values from: Class
    union of: Diseminado
    union of: Entidad colectiva
    union of: Entidad Singular
    union of: Municipio
    union of: Núcleo de Población
subclass of: Restriction
  on property: featureClass
  has value: http://www.geonames.org/ontology#A
subclass of: Restriction
  on property: featureCode
  has value: A.ADMD
issued: 2014-05-03
comment: En sentido jurídico, mancomunidad hace referencia a la asociación libre de municipios, dentro del marco jurídico nacional, que crea una entidad local superior y a la que los municipios asociados delegan parte de las funciones o competencias que la ley les atribuye, al objeto de que se preste un servicio conjuntamente para todos sus miembros. Las mancomunidades son formas asociativas de municipios no territoriales y por lo tanto no requieren que los municipios que las componen sean colindantes. Requieren, eso sí, que se fije con claridad el objetivo, que exista un presupuesto propio y unos órganos de gestión igualmente propios y diferenciados de los participantes. [fuente: Wikipedia] Nota: Si existe una definición oficial de lo que es una mancomunidad, sería bueno incluirla, en lugar de la referencia anterior.

Municipio
type: Class
subclass of: Municipality
subclass of: AdministrativeArea
subclass of: Feature
subclass of: Restriction
  on property: featureClass
  has value: http://www.geonames.org/ontology#P
subclass of: Restriction
  on property: featureCode
  has value: P.PPL
subclass of: Restriction
  on property: pertenece a provincia
  qualified cardinality: 1
  on class: Provincia
issued: 2014-03-28
comment: Un Municipio es el ente local definido en el artículo 140 de la Constitución española y la entidad básica de la organización territorial del Estado según el artículo 1 de la Ley 7/1985, de 2 de abril, Reguladora de las Bases del Régimen Local. Tiene personalidad jurídica y plena capacidad para el cumplimiento de sus fines. La delimitación territorial de Municipio está recogida del REgistro Central de Cartografía del IGN. Su nombre, que se especifica con la propiedad dct:title, es el proporcionado por el Registro de Entidades Locales del Ministerio de Política Territorial, en http://www.ine.es/nomen2/index.do

Núcleo de Población
type: Class
subclass of: Feature
subclass of: Restriction
  on property: featureClass
  has value: http://www.geonames.org/ontology#P
subclass of: Restriction
  on property: featureCode
  has value: P.PPL
subclass of: Restriction
  on property: pertenece a entidad singular
  qualified cardinality: 1
  on class: Entidad Singular
subclass of: Restriction
  on property: pertenece al municipio
  qualified cardinality: 1
  on class: Municipio
issued: 2014-04-15
comment: Conjunto de al menos diez edificaciones, que estén formando calles, plazas y otras vías urbanas. Excepcionalmente el número de edificaciones podrá ser inferior a 10 siempre que la población de derecho supere los 50 habitantes [fuente: Modelo de Direcciones de la Administración General del Estado v.2] Su identificador se especifica con la propiedad dct:identifier, y su nombre se especifica con la propiedad dct:title. Ambos están recogidos por el INE en el Nomenclátor de Unidades Poblacionales, en http://www.ine.es/nomen2/index.do

País
type: Class
subclass of: Country
subclass of: GovernmentalAdministrativeRegion
subclass of: AdministrativeArea
subclass of: Feature
subclass of: Restriction
  on property: featureClass
  has value: http://www.geonames.org/ontology#A
subclass of: Restriction
  on property: featureCode
  has value: A.ADMD
subclass of: Restriction
  on property: capital
  qualified cardinality: 1
  on class: Municipio
issued: 2014-03-28
comment: Un país

Partido judicial
type: Class
subclass of: AdministrativeArea
subclass of: Feature
subclass of: Restriction
  on property: sfContains
  some values from: Class
    union of: Diseminado
    union of: Entidad colectiva
    union of: Entidad Singular
    union of: Municipio
    union of: Núcleo de Población
subclass of: Restriction
  on property: featureClass
  has value: http://www.geonames.org/ontology#A
subclass of: Restriction
  on property: featureCode
  has value: A.ADMD
subclass of: Restriction
  on property: pertenece a provincia
  qualified cardinality: 1
  on class: Provincia
issued: 2014-05-03
comment: Un partido judicial es una unidad territorial para la administración de justicia, integrada por uno o varios municipios limítrofes y pertenecientes a una misma provincia [fuente: Wikipedia] Nota: Si existe una definición oficial de lo que es un partido judicial, sería bueno incluirla, en lugar de la referencia anterior. A pesar de tratarse de una unidad territorial relacionada con el área de Justicia, que por tanto podría aparecer bajo el prefijo http://vocab.linkeddata.es/datosabiertos/def/legislacion-justicia/, se ha considerado conveniente incluirla en este vocabulario

Provincia
type: Class
subclass of: Province
subclass of: State
subclass of: Feature
subclass of: Restriction
  on property: featureClass
  has value: http://www.geonames.org/ontology#A
subclass of: Restriction
  on property: featureCode
  has value: A.ADMD
subclass of: Restriction
  on property: capital
  qualified cardinality: 1
  on class: Municipio
subclass of: Restriction
  on property: sfWithin
  qualified cardinality: 1
  on class: Autonomía
issued: 2014-03-28
comment: Cada una de las grandes divisiones de un territorio o Estado, sujeta por lo común a una autoridad administrativa [fuente: Diccionario de la lengua española (DRAE) 2011]
comment: Entidad local con personalidad jurídica propia, determinada por la agrupación de Municipios y división territorial para el cumplimiento de las actividades del Estado. La delimitación territorial de Provincia está recogida en el Registro Central de Cartografía del IGN [fuente: Modelo de Direcciones de la Administración General del Estado v.2] Su identificador, que se especifica con la propiedad dct:identifier, es el proporcionado por el INE en http://www.ine.es/daco/daco42/codmun/codmun09/09codmun.xls Su nombre, que se especifica con la propiedad dct:title, es el proporcionado por el Registro de Entidades Locales del Ministerio de Política Territorial, en http://www.ine.es/nomen2/index.do

Sección censal
type: Class
subclass of: Feature
subclass of: Restriction
  on property: featureClass
  has value: http://www.geonames.org/ontology#P
subclass of: Restriction
  on property: featureCode
  has value: P.PPLX
subclass of: Restriction
  on property: pertenece al municipio
  qualified cardinality: 1
  on class: Municipio
issued: 2014-03-28
comment: Una sección censal es un referente geográfico de carácter estadístico, cuya actualización se asocia a los trabajos preliminares de todo Padrón Municipal de Habitantes o Censo de Población, siendo un instrumento eficaz tanto en trabajos censales o padronales, así como para investigaciones por muestreo y en el Censo Electoral. [fuente: http://www.madrid.org/iestadis/fijas/clasificaciones/seccioncensal.htm]

HTML

RDF